• command failed with exit code 1 (use -v to see invocation). Does it build locally from a fresh checkout? I'm now experiencing this with Unity 2019.4.3, Xcode 11.2.1. Sure it works if I switch off bitcode for the ld: could not reparse object file in bitcode bundle: 'Invalid bitcode version (Producer...
  • ld: in / Users / Objects-normal / x86_64 / TWRAppDelegate. o, file too small for architecture x86_64 clang: error: linker command failed with exit code 1 (use -v to see invocation) 잘되다 갑자기 linker command failed with exit code 1 에러가 뜬다면. Product -> Clean을 하시고 다시 빌드해보세요~
  • ld: 1 duplicate symbol for architecture i386 clang: error: linker command failed with exit code 1 2014-05-30 symbol ios command debug clang iOS 安装MySQL-python报错error: command 'gcc' failed with exit status 1
  • I am on xcode 11.6 and there is a chance I did the master build with 11.4 ... error: linker command failed with exit code 1 (use -v to see invocation) Traceback (most ...
  • Oct 04, 2018 · ld: library not found for -lstdc++ clang: error: linker command failed with exit code 1 (use -v to see invocation) ** BUILD FAILED ** Moving up to a more recent minimum OS version doesn't help, but it's probably worth considering if it fixes any other problems. 10.7 is eight years old at this point… very few Macs will still be running it.
  • Mar 11, 2019 · I moved codes from extension to its class body block, those errors are gone! After the successful build, I changed the compilation mode back iOS recommended default Incremental mode again. References. Wikipedia: Xcode; Swift org: Swift 5 Released! SO question: Command CompileSwift failed with a nonzero exit code in Xcode 10 ; Read More...
Xcode11での「Command CompileSwiftSources failed with a nonzero exit code」解消方法 2019.12.02 [jquery] jquery datepickerで特定の日付の背景色を変更する方法
Apr 12, 2017 · Steps to reproduce: 1. Create a New project 2. Switch Target platform to iOS 3. Player Settings > Mobile Tab > Other Settings&...
Hello, we are in the process of releasing a new application in the App Store. I can archive and upload the build ok straight from xcode but then I get this issue: Dear Developer, We identified one or more issues with a recent delivery for your app, "McFamily" 3.2.1 (354). linker command failed with exit code 1 (use -v to see invocation)这个错误貌似遇见并不止一次,当我想用某个第三方类库的时候(如SBJson),我直接把类库文件copy到工程目录里面,然后一编译就出现这样错误(并不是一定会出这样错误),开始以为是网上下载的类库本身问题,所以重新找类库或者其他方式将它添加 ...
I'm using Xcode Version 11.0 beta (11M336w). Finally I downloaded a fresh copy and replaced the one I had previously installed. I got the same error when linking separate storyboards. The error, "Command CompileSwiftSources failed with a nonzero exit code." is shown because I simply forgot...
If you work with Xcode code signing long enough you'll run into an error like this: /usr/bin/codesign failed with exit code 1. If you view the build results (Build->Build Results), and expand the error message (there is a little paragraph button on the right-hand side of the line) you may see something...1) deleting Xcode.app 2) downloading and installing Xcode 10.3.xip and Command_Line_Tools_macOS_10.14_for_Xcode_10.3.dmg from Apple Developper website? In particular, is there something to do about the ports successfully upgraded with Xcode 11 before one port failed to upgrade (openblas in my case)? Thanks for your help!
「linker command failed with exit code 1 (use -v to see invocation)」エラーに遭遇したので備忘録で書きます。 このエラーの原因はいろいろとあるようです。エントリーの最後に他の原因のものに関する記事のリンクも載せておきました。 原因 「linker command failed with exit code 1 (use -v to see invocation)」エラーに遭遇したので備忘録で書きます。 このエラーの原因はいろいろとあるようです。エントリーの最後に他の原因のものに関する記事のリンクも載せておきました。 原因

Lennox ml296v installation manual

Aero precision complete lower fde

How much does a griff 300 cost

Free school newsletter templates download

Chemistry ball and stick model kit in india